Reaction Details
TargetProstaglandin G/H synthase 2
LigandBDBM50090676
Substrate/Competitorn/a
Meas. Tech.ChEMBL_510080 (CHEMBL997885)
IC50 2750±n/a nM
Citation Bézière, NGoossens, LPommery, JVezin, HTouati, NHénichart, JPPommery, N New NSAIDs-NO hybrid molecules with antiproliferative properties on human prostatic cancer cell lines. Bioorg Med Chem Lett18:4655-7 (2008) 
 
Prostaglandin G/H synthase 2
Name:Prostaglandin G/H synthase 2
Type:Enzyme
Mol. Mass.:69003.89
Organism:Homo sapiens (Human)
Description:Recombinant Cox-2 provided by Cayman (Cayman Chemical Co.,Ann Arbor, MI).
Residue:604
BDBM50090676
NameBDBM50090676
Synonyms:(+-)-2-(p-(2-thenoyl)phenyl)propionic acid 2-[4-(thiophen-2-ylcarbonyl)phenyl]propanoic acid CHEMBL956 alpha-methyl-4-(2-thienylcarbonyl)benzeneacetic acid | p-2-thenoylhydratropic acid
TypeSmall organic molecule
Emp. Form.C14H12O3S
Mol. Mass.260.308
SMILESCC(C(O)=O)c1ccc(cc1)C(=O)c1cccs1