Reaction Details
TargetHistone deacetylase 2
LigandBDBM50268097
Substrate/Competitorn/a
Meas. Tech.ChEMBL_521104 (CHEMBL960365)
IC50 0.800000±n/a nM
Citation Andrianov, VGailite, VLola, DLoza, ESemenikhina, VKalvinsh, IFinn, PPetersen, KDRitchie, JWKhan, NTumber, ACollins, LSVadlamudi, SMBjörkling, FSehested, M Novel amide derivatives as inhibitors of histone deacetylase: design, synthesis and SAR. Eur J Med Chem44:1067-85 (2009) 
 
Histone deacetylase 2
Name:Histone deacetylase 2
Type:Chromatin regulator; hydrolase; repressor
Mol. Mass.:55356.54
Organism:Homo sapiens (Human)
Description:Q92769
Residue:488
BDBM50268097
NameBDBM50268097
Synonyms:6-{[2-(9H-Fluoren-9-yliden)acetyl]amino}-N-hydroxyhexanamide | CHEMBL485514
TypeSmall organic molecule
Emp. Form.C21H22N2O3
Mol. Mass.350.411
SMILES[#8]-[#7]-[#6](=O)-[#6]-[#6]-[#6]-[#6]-[#6]-[#7]-[#6](=O)\[#6]=[#6]-1\c2ccccc2-c2ccccc-12