Reaction Details
TargetHistone deacetylase 3
LigandBDBM19149
Substrate/Competitorn/a
Meas. Tech.ChEMBL_521105 (CHEMBL960366)
IC50 67±n/a nM
Citation Andrianov, VGailite, VLola, DLoza, ESemenikhina, VKalvinsh, IFinn, PPetersen, KDRitchie, JWKhan, NTumber, ACollins, LSVadlamudi, SMBjörkling, FSehested, M Novel amide derivatives as inhibitors of histone deacetylase: design, synthesis and SAR. Eur J Med Chem44:1067-85 (2009) 
 
Histone deacetylase 3
Name:Histone deacetylase 3
Type:Enzyme
Mol. Mass.:48829.55
Organism:Homo sapiens (Human)
Description:O15379
Residue:428
BDBM19149
NameBDBM19149
Synonyms:CHEMBL98 SAHA US10188756, Compound SAHA US11505523, Compound SAHA US9353061, SAHA US9695181, Vorinostat Zolinza suberoylanilide hydroxamic acid
TypeSmall organic molecule
Emp. Form.C14H20N2O3
Mol. Mass.264.3202
SMILESONC(=O)CCCCCCC(=O)Nc1ccccc1