Reaction Details
TargetHistone deacetylase 8
LigandBDBM50268063
Substrate/Competitorn/a
Meas. Tech.ChEMBL_521110 (CHEMBL960371)
IC50 2028±n/a nM
Citation Andrianov, VGailite, VLola, DLoza, ESemenikhina, VKalvinsh, IFinn, PPetersen, KDRitchie, JWKhan, NTumber, ACollins, LSVadlamudi, SMBjörkling, FSehested, M Novel amide derivatives as inhibitors of histone deacetylase: design, synthesis and SAR. Eur J Med Chem44:1067-85 (2009) 
 
Histone deacetylase 8
Name:Histone deacetylase 8
Type:Enzyme
Mol. Mass.:41749.60
Organism:Homo sapiens (Human)
Description:Q9BY41
Residue:377
BDBM50268063
NameBDBM50268063
Synonyms:(E)-N-[6-(Hydroxyamino)-6-oxohexyl]-3-(7-quinolinyl)-2-propenamide | CHEMBL484073
TypeSmall organic molecule
Emp. Form.C18H21N3O3
Mol. Mass.327.3776
SMILESONC(=O)CCCCCNC(=O)\C=C\c1ccc2cccnc2c1