Reaction Details
TargetHistone deacetylase 9
LigandBDBM50268042
Substrate/Competitorn/a
Meas. Tech.ChEMBL_521111 (CHEMBL960372)
IC50 4.2±n/a nM
Citation Andrianov, VGailite, VLola, DLoza, ESemenikhina, VKalvinsh, IFinn, PPetersen, KDRitchie, JWKhan, NTumber, ACollins, LSVadlamudi, SMBjörkling, FSehested, M Novel amide derivatives as inhibitors of histone deacetylase: design, synthesis and SAR. Eur J Med Chem44:1067-85 (2009) 
 
Histone deacetylase 9
Name:Histone deacetylase 9
Type:Enzyme
Mol. Mass.:111304.31
Organism:Homo sapiens (Human)
Description:Q9UKV0
Residue:1011
BDBM50268042
NameBDBM50268042
Synonyms:(2E,4E)-N-[6-(Hydroxyamino)-6-oxohexyl]-3-methyl-5-phenyl-2,4-pentadienamide | CHEMBL490018
TypeSmall organic molecule
Emp. Form.C18H24N2O3
Mol. Mass.316.3948
SMILESC\C(\C=C\c1ccccc1)=C/C(=O)NCCCCCC(=O)NO