Reaction Details
TargetHistone deacetylase 9
LigandBDBM50268097
Substrate/Competitorn/a
Meas. Tech.ChEMBL_521111 (CHEMBL960372)
IC50 2.3±n/a nM
Citation Andrianov, VGailite, VLola, DLoza, ESemenikhina, VKalvinsh, IFinn, PPetersen, KDRitchie, JWKhan, NTumber, ACollins, LSVadlamudi, SMBjörkling, FSehested, M Novel amide derivatives as inhibitors of histone deacetylase: design, synthesis and SAR. Eur J Med Chem44:1067-85 (2009) 
 
Histone deacetylase 9
Name:Histone deacetylase 9
Type:Enzyme
Mol. Mass.:111304.31
Organism:Homo sapiens (Human)
Description:Q9UKV0
Residue:1011
BDBM50268097
NameBDBM50268097
Synonyms:6-{[2-(9H-Fluoren-9-yliden)acetyl]amino}-N-hydroxyhexanamide | CHEMBL485514
TypeSmall organic molecule
Emp. Form.C21H22N2O3
Mol. Mass.350.411
SMILES[#8]-[#7]-[#6](=O)-[#6]-[#6]-[#6]-[#6]-[#6]-[#7]-[#6](=O)\[#6]=[#6]-1\c2ccccc2-c2ccccc-12