Reaction Details
TargetKappa-type opioid receptor
LigandBDBM50272413
Substrate/Competitorn/a
Meas. Tech.ChEMBL_510208 (CHEMBL1004824)
EC50 790±n/a nM
Citation Hilfiker, MAZhang, DDowdell, SEGoodman, KBMcAtee, JJDodson, JWViet, AQWang, GZSehon, CABehm, DJWu, ZCarballo, LHDouglas, SANeeb, MJ Aminomethylpiperazines as selective urotensin antagonists. Bioorg Med Chem Lett18:4470-3 (2008) 
 
Kappa-type opioid receptor
Name:Kappa-type opioid receptor
Type:G Protein-Coupled Receptor (GPCR)
Mol. Mass.:42648.76
Organism:Homo sapiens (Human)
Description:P41145
Residue:380
BDBM50272413
NameBDBM50272413
Synonyms:5-chloro-3-(2-oxo-2-(4-(phenylsulfonyl)-2-(pyrrolidin-1-ylmethyl)piperazin-1-yl)ethyl)benzo[d]oxazol-2(3H)-one | CHEMBL498329
TypeSmall organic molecule
Emp. Form.C24H27ClN4O5S
Mol. Mass.519.013
SMILESClc1ccc2oc(=O)n(CC(=O)N3CCN(CC3CN3CCCC3)S(=O)(=O)c3ccccc3)c2c1