Reaction Details
TargetKappa-type opioid receptor
LigandBDBM50272327
Substrate/Competitorn/a
Meas. Tech.ChEMBL_510208 (CHEMBL1004824)
EC50 400±n/a nM
Citation Hilfiker, MAZhang, DDowdell, SEGoodman, KBMcAtee, JJDodson, JWViet, AQWang, GZSehon, CABehm, DJWu, ZCarballo, LHDouglas, SANeeb, MJ Aminomethylpiperazines as selective urotensin antagonists. Bioorg Med Chem Lett18:4470-3 (2008) 
 
Kappa-type opioid receptor
Name:Kappa-type opioid receptor
Type:G Protein-Coupled Receptor (GPCR)
Mol. Mass.:42648.76
Organism:Homo sapiens (Human)
Description:P41145
Residue:380
BDBM50272327
NameBDBM50272327
Synonyms:2-((3,4-dichlorophenyl)(methyl)amino)-1-(4-(3,4-difluorophenylsulfonyl)-2-(pyrrolidin-1-ylmethyl)piperazin-1-yl)ethanone | CHEMBL496084
TypeSmall organic molecule
Emp. Form.C24H28Cl2F2N4O3S
Mol. Mass.561.472
SMILESCN(CC(=O)N1CCN(CC1CN1CCCC1)S(=O)(=O)c1ccc(F)c(F)c1)c1ccc(Cl)c(Cl)c1