Reaction Details
TargetKappa-type opioid receptor
LigandBDBM50272255
Substrate/Competitorn/a
Meas. Tech.ChEMBL_510208 (CHEMBL1004824)
EC50>10000±n/a nM
Citation Hilfiker, MAZhang, DDowdell, SEGoodman, KBMcAtee, JJDodson, JWViet, AQWang, GZSehon, CABehm, DJWu, ZCarballo, LHDouglas, SANeeb, MJ Aminomethylpiperazines as selective urotensin antagonists. Bioorg Med Chem Lett18:4470-3 (2008) 
 
Kappa-type opioid receptor
Name:Kappa-type opioid receptor
Type:G Protein-Coupled Receptor (GPCR)
Mol. Mass.:42648.76
Organism:Homo sapiens (Human)
Description:P41145
Residue:380
BDBM50272255
NameBDBM50272255
Synonyms:2-((3,4-dichlorophenyl)(methyl)amino)-1-(4-(3,4-dimethoxybenzoyl)-2-(pyrrolidin-1-ylmethyl)piperazin-1-yl)ethanone | CHEMBL526735
TypeSmall organic molecule
Emp. Form.C27H34Cl2N4O4
Mol. Mass.549.489
SMILESCOc1ccc(cc1OC)C(=O)N1CCN(C(CN2CCCC2)C1)C(=O)CN(C)c1ccc(Cl)c(Cl)c1