Reaction Details
TargetKappa-type opioid receptor
LigandBDBM50272252
Substrate/Competitorn/a
Meas. Tech.ChEMBL_510208 (CHEMBL1004824)
EC50 4±n/a nM
Citation Hilfiker, MAZhang, DDowdell, SEGoodman, KBMcAtee, JJDodson, JWViet, AQWang, GZSehon, CABehm, DJWu, ZCarballo, LHDouglas, SANeeb, MJ Aminomethylpiperazines as selective urotensin antagonists. Bioorg Med Chem Lett18:4470-3 (2008) 
 
Kappa-type opioid receptor
Name:Kappa-type opioid receptor
Type:G Protein-Coupled Receptor (GPCR)
Mol. Mass.:42648.76
Organism:Homo sapiens (Human)
Description:P41145
Residue:380
BDBM50272252
NameBDBM50272252
Synonyms:1-(4-(3-chlorophenyl)-2-(pyrrolidin-1-ylmethyl)piperazin-1-yl)-2-((3,4-dichlorophenyl)(methyl)amino)ethanone | CHEMBL524367
TypeSmall organic molecule
Emp. Form.C24H29Cl3N4O
Mol. Mass.495.872
SMILESCN(CC(=O)N1CCN(CC1CN1CCCC1)c1cccc(Cl)c1)c1ccc(Cl)c(Cl)c1