Reaction Details
TargetKappa-type opioid receptor
LigandBDBM50272197
Substrate/Competitorn/a
Meas. Tech.ChEMBL_510208 (CHEMBL1004824)
EC50 1.3±n/a nM
Citation Hilfiker, MAZhang, DDowdell, SEGoodman, KBMcAtee, JJDodson, JWViet, AQWang, GZSehon, CABehm, DJWu, ZCarballo, LHDouglas, SANeeb, MJ Aminomethylpiperazines as selective urotensin antagonists. Bioorg Med Chem Lett18:4470-3 (2008) 
 
Kappa-type opioid receptor
Name:Kappa-type opioid receptor
Type:G Protein-Coupled Receptor (GPCR)
Mol. Mass.:42648.76
Organism:Homo sapiens (Human)
Description:P41145
Residue:380
BDBM50272197
NameBDBM50272197
Synonyms:2-((3,4-dichlorophenyl)(methyl)amino)-1-(4-phenyl-2-(pyrrolidin-1-ylmethyl)piperazin-1-yl)ethanone | CHEMBL502267
TypeSmall organic molecule
Emp. Form.C24H30Cl2N4O
Mol. Mass.461.427
SMILESCN(CC(=O)N1CCN(CC1CN1CCCC1)c1ccccc1)c1ccc(Cl)c(Cl)c1