Reaction Details
TargetDelta-type opioid receptor
LigandBDBM50272328
Substrate/Competitorn/a
Meas. Tech.ChEMBL_510226 (CHEMBL1005604)
Ki 23±n/a nM
Citation Fulton, BSKnapp, BIBidlack, JMNeumeyer, JL Synthesis and pharmacological evaluation of hydrophobic esters and ethers of butorphanol at opioid receptors. Bioorg Med Chem Lett18:4474-6 (2008) 
 
Delta-type opioid receptor
Name:Delta-type opioid receptor
Type:G Protein-Coupled Receptor (GPCR)
Mol. Mass.:40382.98
Organism:Homo sapiens (Human)
Description:Competition binding assays were carried out using membrane preparations from transfected HN9.10 cells that constitutively expressed the delta opioid receptor.
Residue:372
BDBM50272328
NameBDBM50272328
Synonyms:(1S,9R,10S)-17-(cyclobutylmethyl)-10-hydroxy-17-azatetracyclo[7.5.3.0^{1,10}.0^{2,7}]heptadeca-2(7),3,5-trien-4-yl 2-(4-methoxyphenyl)acetate hydrochloride | CHEMBL521543
TypeSmall organic molecule
Emp. Form.C30H37NO4
Mol. Mass.475.6191
SMILESCOc1ccc(CC(=O)Oc2ccc3C[C@H]4N(CC5CCC5)CC[C@@]5(CCCC[C@@]45O)c3c2)cc1