Reaction Details
TargetDelta-type opioid receptor
LigandBDBM50272256
Substrate/Competitorn/a
Meas. Tech.ChEMBL_510226 (CHEMBL1005604)
Ki 12±n/a nM
Citation Fulton, BSKnapp, BIBidlack, JMNeumeyer, JL Synthesis and pharmacological evaluation of hydrophobic esters and ethers of butorphanol at opioid receptors. Bioorg Med Chem Lett18:4474-6 (2008) 
 
Delta-type opioid receptor
Name:Delta-type opioid receptor
Type:G Protein-Coupled Receptor (GPCR)
Mol. Mass.:40382.98
Organism:Homo sapiens (Human)
Description:Competition binding assays were carried out using membrane preparations from transfected HN9.10 cells that constitutively expressed the delta opioid receptor.
Residue:372
BDBM50272256
NameBDBM50272256
Synonyms:(2R,6S,11R)-3-Cyclopropylmethyl-6,11-dimethyl-1,2,3,4,5,6-hexahydro-2,6-methano-benzo[d]azocine-8-carboxylic acid (2-biphenyl-4-yl-ethyl)-methyl-amide | CHEMBL499884
TypeSmall organic molecule
Emp. Form.C34H40N2O
Mol. Mass.492.6942
SMILESC[C@H]1[C@H]2Cc3ccc(cc3[C@@]1(C)CCN2CC1CC1)C(=O)N(C)CCc1ccc(cc1)-c1ccccc1