Reaction Details
TargetMu-type opioid receptor
LigandBDBM50017233
Substrate/Competitorn/a
Meas. Tech.ChEMBL_510225 (CHEMBL1005603)
Ki 0.210000±n/a nM
Citation Fulton, BSKnapp, BIBidlack, JMNeumeyer, JL Synthesis and pharmacological evaluation of hydrophobic esters and ethers of butorphanol at opioid receptors. Bioorg Med Chem Lett18:4474-6 (2008) 
 
Mu-type opioid receptor
Name:Mu-type opioid receptor
Type:G Protein-Coupled Receptor (GPCR)
Mol. Mass.:44789.51
Organism:Homo sapiens (Human)
Description:P35372
Residue:400
BDBM50017233
NameBDBM50017233
Synonyms:CHEMBL592 LEVORPHANOL
TypeSmall organic molecule
Emp. Form.C17H23NO
Mol. Mass.257.3706
SMILESCN1CC[C@]23CCCC[C@H]2[C@H]1Cc1ccc(O)cc31