Reaction Details
TargetMu-type opioid receptor
LigandBDBM50272329
Substrate/Competitorn/a
Meas. Tech.ChEMBL_510225 (CHEMBL1005603)
Ki 55±n/a nM
Citation Fulton, BSKnapp, BIBidlack, JMNeumeyer, JL Synthesis and pharmacological evaluation of hydrophobic esters and ethers of butorphanol at opioid receptors. Bioorg Med Chem Lett18:4474-6 (2008) 
 
Mu-type opioid receptor
Name:Mu-type opioid receptor
Type:G Protein-Coupled Receptor (GPCR)
Mol. Mass.:44789.51
Organism:Homo sapiens (Human)
Description:P35372
Residue:400
BDBM50272329
NameBDBM50272329
Synonyms:2-{[(1S,9R,10S)-17-(cyclobutylmethyl)-10-hydroxy-17-azatetracyclo[7.5.3.0^{1,10}.0^{2,7}]heptadeca-2(7),3,5-trien-4-yl]oxy}acetamide hydrochloride | CHEMBL497108
TypeSmall organic molecule
Emp. Form.C23H32N2O3
Mol. Mass.384.5118
SMILESNC(=O)COc1ccc2C[C@H]3N(CC4CCC4)CC[C@@]4(CCCC[C@@]34O)c2c1