Reaction Details
TargetMu-type opioid receptor
LigandBDBM50272298
Substrate/Competitorn/a
Meas. Tech.ChEMBL_510225 (CHEMBL1005603)
Ki 0.061000±n/a nM
Citation Fulton, BSKnapp, BIBidlack, JMNeumeyer, JL Synthesis and pharmacological evaluation of hydrophobic esters and ethers of butorphanol at opioid receptors. Bioorg Med Chem Lett18:4474-6 (2008) 
 
Mu-type opioid receptor
Name:Mu-type opioid receptor
Type:G Protein-Coupled Receptor (GPCR)
Mol. Mass.:44789.51
Organism:Homo sapiens (Human)
Description:P35372
Residue:400
BDBM50272298
NameBDBM50272298
Synonyms:(-)-N-cyclobutylmethylmorphinan-3-yl-14-ol phenoxy acetate hydrochloride | CHEMBL500419
TypeSmall organic molecule
Emp. Form.C29H35NO4
Mol. Mass.461.5925
SMILESO[C@@]12CCCC[C@@]11CCN(CC3CCC3)[C@@H]2Cc2ccc(OC(=O)COc3ccccc3)cc12