Reaction Details
TargetB1 bradykinin receptor
LigandBDBM50272455
Substrate/Competitorn/a
Meas. Tech.ChEMBL_510231 (CHEMBL1005609)
Ki 0.19±n/a nM
Citation Chen, JJQian, WBiswas, KViswanadhan, VNAskew, BCHitchcock, SHungate, RWArik, LJohnson, E Discovery of dihydroquinoxalinone acetamides containing bicyclic amines as potent Bradykinin B1 receptor antagonists. Bioorg Med Chem Lett18:4477-81 (2008) 
 
B1 bradykinin receptor
Name:B1 bradykinin receptor
Type:Enzyme
Mol. Mass.:40508.87
Organism:Homo sapiens (Human)
Description:P46663
Residue:353
BDBM50272455
NameBDBM50272455
Synonyms:2-((R)-3-oxo-1-(phenylsulfonyl)-1,2,3,4-tetrahydroquinoxalin-2-yl)-N-((R)-7-(piperidin-1-ylmethyl)chroman-4-yl)acetamide | CHEMBL502140
TypeSmall organic molecule
Emp. Form.C31H34N4O5S
Mol. Mass.574.69
SMILESO=C(C[C@H]1N(c2ccccc2NC1=O)S(=O)(=O)c1ccccc1)N[C@@H]1CCOc2cc(CN3CCCCC3)ccc12