Reaction Details
TargetB1 bradykinin receptor
LigandBDBM50272452
Substrate/Competitorn/a
Meas. Tech.ChEMBL_510231 (CHEMBL1005609)
Ki 0.15±n/a nM
Citation Chen, JJQian, WBiswas, KViswanadhan, VNAskew, BCHitchcock, SHungate, RWArik, LJohnson, E Discovery of dihydroquinoxalinone acetamides containing bicyclic amines as potent Bradykinin B1 receptor antagonists. Bioorg Med Chem Lett18:4477-81 (2008) 
 
B1 bradykinin receptor
Name:B1 bradykinin receptor
Type:Enzyme
Mol. Mass.:40508.87
Organism:Homo sapiens (Human)
Description:P46663
Residue:353
BDBM50272452
NameBDBM50272452
Synonyms:2-((R)-1-(3,4-dichlorophenylsulfonyl)-3-oxo-1,2,3,4-tetrahydroquinoxalin-2-yl)-N-((R)-7-(piperidin-1-ylmethyl)chroman-4-yl)acetamide | CHEMBL450541
TypeSmall organic molecule
Emp. Form.C31H32Cl2N4O5S
Mol. Mass.643.581
SMILESClc1ccc(cc1Cl)S(=O)(=O)N1[C@H](CC(=O)N[C@@H]2CCOc3cc(CN4CCCCC4)ccc23)C(=O)Nc2ccccc12