Reaction Details
TargetEpidermal growth factor receptor
LigandBDBM50245322
Substrate/Competitorn/a
Meas. Tech.ChEMBL_512831 (CHEMBL971642)
IC50 76±n/a nM
Citation Hughes, TVXu, GWetter, SKConnolly, PJEmanuel, SLKarnachi, PPollack, SRPandey, NAdams, MMoreno-Mazza, SMiddleton, SAGreenberger, LM A novel 5-[1,3,4-oxadiazol-2-yl]-N-aryl-4,6-pyrimidine diamine having dual EGFR/HER2 kinase activity: design, synthesis, and biological activity. Bioorg Med Chem Lett18:4896-9 (2008) 
 
Epidermal growth factor receptor
Name:Epidermal growth factor receptor
Type:Receptor Kinase Domain
Mol. Mass.:134279.59
Organism:Homo sapiens (Human)
Description:P00533
Residue:1210
BDBM50245322
NameBDBM50245322
Synonyms:4-amino-6-(4-(benzyloxy)-3-chlorophenylamino)pyrimidine-5-carbaldehyde | CHEMBL461311
TypeSmall organic molecule
Emp. Form.C18H15ClN4O2
Mol. Mass.354.79
SMILESNc1ncnc(Nc2ccc(OCc3ccccc3)c(Cl)c2)c1C=O