Reaction Details
TargetVascular endothelial growth factor receptor 2
LigandBDBM50245442
Substrate/Competitorn/a
Meas. Tech.ChEMBL_512837 (CHEMBL972550)
IC50>100000±n/a nM
Citation Hughes, TVXu, GWetter, SKConnolly, PJEmanuel, SLKarnachi, PPollack, SRPandey, NAdams, MMoreno-Mazza, SMiddleton, SAGreenberger, LM A novel 5-[1,3,4-oxadiazol-2-yl]-N-aryl-4,6-pyrimidine diamine having dual EGFR/HER2 kinase activity: design, synthesis, and biological activity. Bioorg Med Chem Lett18:4896-9 (2008) 
 
Vascular endothelial growth factor receptor 2
Name:Vascular endothelial growth factor receptor 2
Type:Receptor Tyrosine Kinase
Mol. Mass.:151510.97
Organism:Homo sapiens (Human)
Description:P35968
Residue:1356
BDBM50245442
NameBDBM50245442
Synonyms:3-fluorobenzyl 4-amino-6-(4-(benzyloxy)-3-chlorophenylamino)pyrimidine-5-carboxylate | CHEMBL472382
TypeSmall organic molecule
Emp. Form.C25H20ClFN4O3
Mol. Mass.478.903
SMILESNc1ncnc(Nc2ccc(OCc3ccccc3)c(Cl)c2)c1C(=O)OCc1cccc(F)c1