Reaction Details
TargetMu-type opioid receptor
LigandBDBM50272170
Substrate/Competitorn/a
Meas. Tech.ChEMBL_510433 (CHEMBL1003109)
Ki 1.75±n/a nM
Citation Balboni, GFiorini, SBaldisserotto, ATrapella, CSasaki, YAmbo, AMarczak, EDLazarus, LHSalvadori, S Further studies on lead compounds containing the opioid pharmacophore Dmt-Tic. J Med Chem51:5109-17 (2008) 
 
Mu-type opioid receptor
Name:Mu-type opioid receptor
Type:G Protein-Coupled Receptor (GPCR)
Mol. Mass.:44503.11
Organism:Rattus norvegicus (rat)
Description:Competition binding assays were carried out using membrane preparations from transfected HN9.10 cells that constitutively expressed the mu opioid receptor.
Residue:398
BDBM50272170
NameBDBM50272170
Synonyms:CHEMBL500937 | H-Dmt-Tic-Gly-N(Me)-Ph
TypeSmall organic molecule
Emp. Form.C30H34N4O4
Mol. Mass.514.6154
SMILESCN(C(=O)CNC(=O)[C@@H]1Cc2ccccc2CN1C(=O)[C@@H](N)Cc1c(C)cc(O)cc1C)c1ccccc1