Reaction Details
TargetMu-type opioid receptor
LigandBDBM50272081
Substrate/Competitorn/a
Meas. Tech.ChEMBL_510434 (CHEMBL1003110)
IC50 3.02±n/a nM
Citation Balboni, GFiorini, SBaldisserotto, ATrapella, CSasaki, YAmbo, AMarczak, EDLazarus, LHSalvadori, S Further studies on lead compounds containing the opioid pharmacophore Dmt-Tic. J Med Chem51:5109-17 (2008) 
 
Mu-type opioid receptor
Name:Mu-type opioid receptor
Synonyms:Mu-opioid receptor
Type:PROTEIN
Mol. Mass.:44729.40
Organism:Cavia porcellus
Description:ChEMBL_510437
Residue:400
BDBM50272081
NameBDBM50272081
TypeSmall organic molecule
Emp. Form.C29H32N4O4
Mol. Mass.500.5888
SMILESCc1cc(O)cc(C)c1C[C@H](N)C(=O)N1Cc2ccccc2C[C@H]1C(=O)NCC(=O)Nc1ccccc1