Reaction Details
TargetDelta-type opioid receptor
LigandBDBM50179191
Substrate/Competitorn/a
Meas. Tech.ChEMBL_510432 (CHEMBL1003108)
Ki 0.035±n/a nM
Citation Balboni, GFiorini, SBaldisserotto, ATrapella, CSasaki, YAmbo, AMarczak, EDLazarus, LHSalvadori, S Further studies on lead compounds containing the opioid pharmacophore Dmt-Tic. J Med Chem51:5109-17 (2008) 
 
Delta-type opioid receptor
Name:Delta-type opioid receptor
Type:G Protein-Coupled Receptor (GPCR)
Mol. Mass.:40465.04
Organism:Rattus norvegicus (rat)
Description:Competition binding assays were using CHO-K1 cell membranes expressing the opioid receptor.
Residue:372
BDBM50179191
NameBDBM50179191
Synonyms:(S)-N-((1H-benzo[d]imidazol-2-yl)methyl)-2-((S)-2-amino-3-(4-hydroxy-2,6-dimethylphenyl)propanoyl)-1,2,3,4-tetrahydroisoquinoline-3-carboxamide CHEMBL109390 UFP-502
TypeSmall organic molecule
Emp. Form.C29H31N5O3
Mol. Mass.497.5881
SMILESCc1cc(O)cc(C)c1C[C@H](N)C(=O)N1Cc2ccccc2C[C@H]1C(=O)NCc1nc2ccccc2[nH]1