Reaction Details
TargetMelanocortin receptor 4
LigandBDBM50245719
Substrate/Competitorn/a
Meas. Tech.ChEMBL_513112 (CHEMBL973601)
Ki 11±n/a nM
Citation Marinkovic, DTucci, FCTran, JAFleck, BAWen, JChen, C Structure-activity relationship studies on a series of piperazinebenzylalcohols and their ketone and amine analogs as melanocortin-4 receptor ligands. Bioorg Med Chem Lett18:4817-22 (2008) 
 
Melanocortin receptor 4
Name:Melanocortin receptor 4
Type:Enzyme
Mol. Mass.:36949.50
Organism:Homo sapiens (Human)
Description:P32245
Residue:332
BDBM50245719
NameBDBM50245719
Synonyms:3-amino-N-((R)-3-(2,4-dichlorophenyl)-1-(4-(2-(2-hydroxypentan-2-yl)phenyl)piperazin-1-yl)-1-oxopropan-2-yl)propanamide | CHEMBL454663
TypeSmall organic molecule
Emp. Form.C27H36Cl2N4O3
Mol. Mass.535.506
SMILESCCCC(C)(O)c1ccccc1N1CCN(CC1)C(=O)[C@@H](Cc1ccc(Cl)cc1Cl)NC(=O)CCN