Reaction Details
TargetMelanocortin receptor 4
LigandBDBM50245537
Substrate/Competitorn/a
Meas. Tech.ChEMBL_513112 (CHEMBL973601)
Ki 7.7±n/a nM
Citation Marinkovic, DTucci, FCTran, JAFleck, BAWen, JChen, C Structure-activity relationship studies on a series of piperazinebenzylalcohols and their ketone and amine analogs as melanocortin-4 receptor ligands. Bioorg Med Chem Lett18:4817-22 (2008) 
 
Melanocortin receptor 4
Name:Melanocortin receptor 4
Type:Enzyme
Mol. Mass.:36949.50
Organism:Homo sapiens (Human)
Description:P32245
Residue:332
BDBM50245537
NameBDBM50245537
Synonyms:2-amino-N-((R)-1-(4-(2-(1-amino-3-methylbutyl)phenyl)piperazin-1-yl)-3-(2,4-dichlorophenyl)-1-oxopropan-2-yl)-2-methylpropanamide | CHEMBL528108
TypeSmall organic molecule
Emp. Form.C28H39Cl2N5O2
Mol. Mass.548.548
SMILESCC(C)CC(N)c1ccccc1N1CCN(CC1)C(=O)[C@@H](Cc1ccc(Cl)cc1Cl)NC(=O)C(C)(C)N