Reaction Details
TargetMelanocortin receptor 4
LigandBDBM50245485
Substrate/Competitorn/a
Meas. Tech.ChEMBL_513112 (CHEMBL973601)
Ki 13±n/a nM
Citation Marinkovic, DTucci, FCTran, JAFleck, BAWen, JChen, C Structure-activity relationship studies on a series of piperazinebenzylalcohols and their ketone and amine analogs as melanocortin-4 receptor ligands. Bioorg Med Chem Lett18:4817-22 (2008) 
 
Melanocortin receptor 4
Name:Melanocortin receptor 4
Type:Enzyme
Mol. Mass.:36949.50
Organism:Homo sapiens (Human)
Description:P32245
Residue:332
BDBM50245485
NameBDBM50245485
Synonyms:2-amino-N-((R)-3-(2,4-dichlorophenyl)-1-(4-(2-(1-hydroxy-3-methylbutyl)phenyl)piperazin-1-yl)-1-oxopropan-2-yl)acetamide | CHEMBL471339
TypeSmall organic molecule
Emp. Form.C26H34Cl2N4O3
Mol. Mass.521.479
SMILESCC(C)CC(O)c1ccccc1N1CCN(CC1)C(=O)[C@@H](Cc1ccc(Cl)cc1Cl)NC(=O)CN