Reaction Details
TargetMelanocortin receptor 4
LigandBDBM50245371
Substrate/Competitorn/a
Meas. Tech.ChEMBL_513112 (CHEMBL973601)
Ki 2±n/a nM
Citation Marinkovic, DTucci, FCTran, JAFleck, BAWen, JChen, C Structure-activity relationship studies on a series of piperazinebenzylalcohols and their ketone and amine analogs as melanocortin-4 receptor ligands. Bioorg Med Chem Lett18:4817-22 (2008) 
 
Melanocortin receptor 4
Name:Melanocortin receptor 4
Type:Enzyme
Mol. Mass.:36949.50
Organism:Homo sapiens (Human)
Description:P32245
Residue:332
BDBM50245371
NameBDBM50245371
Synonyms:(2R)-1-(4-(2-(1-amino-3-methylbutyl)phenyl)piperazin-1-yl)-2-(bis(pyridin-2-ylmethyl)amino)-3-(2,4-dichlorophenyl)propan-1-one | CHEMBL505442
TypeSmall organic molecule
Emp. Form.C36H42Cl2N6O
Mol. Mass.645.664
SMILESCC(C)CC(N)c1ccccc1N1CCN(CC1)C(=O)[C@@H](Cc1ccc(Cl)cc1Cl)N(Cc1ccccn1)Cc1ccccn1