Reaction Details
TargetVascular endothelial growth factor receptor 2
LigandBDBM50245422
Substrate/Competitorn/a
Meas. Tech.ChEMBL_513139 (CHEMBL973628)
IC50 1±n/a nM
Citation Bauer, DWhittington, DACoxon, ABready, JHarriman, SPPatel, VFPolverino, AHarmange, JC Evaluation of indazole-based compounds as a new class of potent KDR/VEGFR-2 inhibitors. Bioorg Med Chem Lett18:4844-8 (2008) 
 
Vascular endothelial growth factor receptor 2
Name:Vascular endothelial growth factor receptor 2
Type:Receptor Tyrosine Kinase
Mol. Mass.:151510.97
Organism:Homo sapiens (Human)
Description:P35968
Residue:1356
BDBM50245422
NameBDBM50245422
Synonyms:6-(6,7-dimethoxyquinolin-4-yloxy)-N-(2-methoxyphenyl)naphthalen-1-amine | CHEMBL459896
TypeSmall organic molecule
Emp. Form.C28H24N2O4
Mol. Mass.452.5012
SMILESCOc1ccccc1Nc1cccc2cc(Oc3ccnc4cc(OC)c(OC)cc34)ccc12