Reaction Details
TargetVascular endothelial growth factor receptor 2
LigandBDBM50245418
Substrate/Competitorn/a
Meas. Tech.ChEMBL_513139 (CHEMBL973628)
IC50 2±n/a nM
Citation Bauer, DWhittington, DACoxon, ABready, JHarriman, SPPatel, VFPolverino, AHarmange, JC Evaluation of indazole-based compounds as a new class of potent KDR/VEGFR-2 inhibitors. Bioorg Med Chem Lett18:4844-8 (2008) 
 
Vascular endothelial growth factor receptor 2
Name:Vascular endothelial growth factor receptor 2
Type:Receptor Tyrosine Kinase
Mol. Mass.:151510.97
Organism:Homo sapiens (Human)
Description:P35968
Residue:1356
BDBM50245418
NameBDBM50245418
Synonyms:CHEMBL518203 | N-(6-(6,7-dimethoxyquinolin-4-yloxy)-1-methyl-1H-indazol-3-yl)-3-methylbenzamide
TypeSmall organic molecule
Emp. Form.C27H24N4O4
Mol. Mass.468.5039
SMILESCOc1cc2nccc(Oc3ccc4c(NC(=O)c5cccc(C)c5)nn(C)c4c3)c2cc1OC