Reaction Details
TargetVascular endothelial growth factor receptor 2
LigandBDBM50245375
Substrate/Competitorn/a
Meas. Tech.ChEMBL_513139 (CHEMBL973628)
IC50 3±n/a nM
Citation Bauer, DWhittington, DACoxon, ABready, JHarriman, SPPatel, VFPolverino, AHarmange, JC Evaluation of indazole-based compounds as a new class of potent KDR/VEGFR-2 inhibitors. Bioorg Med Chem Lett18:4844-8 (2008) 
 
Vascular endothelial growth factor receptor 2
Name:Vascular endothelial growth factor receptor 2
Type:Receptor Tyrosine Kinase
Mol. Mass.:151510.97
Organism:Homo sapiens (Human)
Description:P35968
Residue:1356
BDBM50245375
NameBDBM50245375
Synonyms:CHEMBL462348 | N-(6-(6,7-dimethoxyquinolin-4-yloxy)-1-methyl-1H-indazol-3-yl)-4-methoxybenzamide
TypeSmall organic molecule
Emp. Form.C27H24N4O5
Mol. Mass.484.5033
SMILESCOc1ccc(cc1)C(=O)Nc1nn(C)c2cc(Oc3ccnc4cc(OC)c(OC)cc34)ccc12