Reaction Details
TargetVascular endothelial growth factor receptor 2
LigandBDBM50245293
Substrate/Competitorn/a
Meas. Tech.ChEMBL_513139 (CHEMBL973628)
IC50 160±n/a nM
Citation Bauer, DWhittington, DACoxon, ABready, JHarriman, SPPatel, VFPolverino, AHarmange, JC Evaluation of indazole-based compounds as a new class of potent KDR/VEGFR-2 inhibitors. Bioorg Med Chem Lett18:4844-8 (2008) 
 
Vascular endothelial growth factor receptor 2
Name:Vascular endothelial growth factor receptor 2
Type:Receptor Tyrosine Kinase
Mol. Mass.:151510.97
Organism:Homo sapiens (Human)
Description:P35968
Residue:1356
BDBM50245293
NameBDBM50245293
Synonyms:6-(6,7-dimethoxyquinolin-4-yloxy)-N-(4-methoxyphenyl)-1-methyl-1H-indazol-3-amine | CHEMBL460077
TypeSmall organic molecule
Emp. Form.C26H24N4O4
Mol. Mass.456.4932
SMILESCOc1ccc(Nc2nn(C)c3cc(Oc4ccnc5cc(OC)c(OC)cc45)ccc23)cc1