Reaction Details
TargetVascular endothelial growth factor receptor 2
LigandBDBM50245222
Substrate/Competitorn/a
Meas. Tech.ChEMBL_513139 (CHEMBL973628)
IC50 800±n/a nM
Citation Bauer, DWhittington, DACoxon, ABready, JHarriman, SPPatel, VFPolverino, AHarmange, JC Evaluation of indazole-based compounds as a new class of potent KDR/VEGFR-2 inhibitors. Bioorg Med Chem Lett18:4844-8 (2008) 
 
Vascular endothelial growth factor receptor 2
Name:Vascular endothelial growth factor receptor 2
Type:Receptor Tyrosine Kinase
Mol. Mass.:151510.97
Organism:Homo sapiens (Human)
Description:P35968
Residue:1356
BDBM50245222
NameBDBM50245222
Synonyms:CHEMBL453354 | N-butyl-6-(6,7-dimethoxyquinolin-4-yloxy)-1-methyl-1H-indazol-3-amine
TypeSmall organic molecule
Emp. Form.C23H26N4O3
Mol. Mass.406.4775
SMILESCCCCNc1nn(C)c2cc(Oc3ccnc4cc(OC)c(OC)cc34)ccc12