Reaction Details
TargetCholecystokinin receptor type A
LigandBDBM50245186
Substrate/Competitorn/a
Meas. Tech.ChEMBL_513421 (CHEMBL976508)
EC50 0.11±n/a nM
Citation Berger, RZhu, CHansen, ARHarper, BChen, ZHolt, TGHubert, JLee, SJPan, JQian, SReitman, MLStrack, AMWeingarth, DTWolff, MMacneil, DJWeber, AEEdmondson, SD 2-Substituted piperazine-derived imidazole carboxamides as potent and selective CCK1R agonists for the treatment of obesity. Bioorg Med Chem Lett18:4833-7 (2008) 
 
Cholecystokinin receptor type A
Name:Cholecystokinin receptor type A
Type:PROTEIN
Mol. Mass.:48454.29
Organism:Mus musculus
Description:ChEMBL_40042
Residue:436
BDBM50245186
NameBDBM50245186
Synonyms:3-((S)-4-(1-(3-ethoxyphenyl)-2-p-tolyl-1H-imidazole-4-carbonyl)-3-(isopropylcarbamoyl)piperazin-1-yl)-1-naphthoic acid | CHEMBL509464
TypeSmall organic molecule
Emp. Form.C38H39N5O5
Mol. Mass.645.7468
SMILESCCOc1cccc(c1)-n1cc(nc1-c1ccc(C)cc1)C(=O)N1CCN(C[C@H]1C(=O)NC(C)C)c1cc(C(O)=O)c2ccccc2c1