Reaction Details
TargetCholecystokinin receptor type A
LigandBDBM50245205
Substrate/Competitorn/a
Meas. Tech.ChEMBL_513421 (CHEMBL976508)
EC50 0.11±n/a nM
Citation Berger, RZhu, CHansen, ARHarper, BChen, ZHolt, TGHubert, JLee, SJPan, JQian, SReitman, MLStrack, AMWeingarth, DTWolff, MMacneil, DJWeber, AEEdmondson, SD 2-Substituted piperazine-derived imidazole carboxamides as potent and selective CCK1R agonists for the treatment of obesity. Bioorg Med Chem Lett18:4833-7 (2008) 
 
Cholecystokinin receptor type A
Name:Cholecystokinin receptor type A
Type:PROTEIN
Mol. Mass.:48454.29
Organism:Mus musculus
Description:ChEMBL_40042
Residue:436
BDBM50245205
NameBDBM50245205
Synonyms:2-((S)-1-(1-(3-ethoxyphenyl)-2-p-tolyl-1H-imidazole-4-carbonyl)-4-(quinolin-3-yl)piperazine-6-carboxamido)acetic acid | CHEMBL450105
TypeSmall organic molecule
Emp. Form.C35H34N6O5
Mol. Mass.618.6817
SMILESCCOc1cccc(c1)-n1cc(nc1-c1ccc(C)cc1)C(=O)N1CCN(C[C@H]1C(=O)NCC(O)=O)c1cnc2ccccc2c1