Reaction Details
TargetProto-oncogene tyrosine-protein kinase Src
LigandBDBM50244621
Substrate/Competitorn/a
Meas. Tech.ChEMBL_511627 (CHEMBL976274)
IC50<0.230000±n/a nM
Citation Wang, YShakespeare, WCHuang, WSSundaramoorthi, RLentini, SDas, SLiu, SBanda, GWen, DZhu, XXu, QKeats, JWang, FWardwell, SNing, YSnodgrass, JTBroudy, MIRussian, KDalgarno, DClackson, TSawyer, TK Novel N9-arenethenyl purines as potent dual Src/Abl tyrosine kinase inhibitors. Bioorg Med Chem Lett18:4907-12 (2008) 
 
Proto-oncogene tyrosine-protein kinase Src
Name:Proto-oncogene tyrosine-protein kinase Src
Type:Protein
Mol. Mass.:59838.60
Organism:Homo sapiens (Human)
Description:P12931
Residue:536
BDBM50244621
NameBDBM50244621
Synonyms:9-(2,6-dimethylstyryl)-N-(4-(dimethylphosphoryl)phenyl)-2-morpholino-9H-purin-6-amine | CHEMBL454358
TypeSmall organic molecule
Emp. Form.C27H31N6O2P
Mol. Mass.502.5478
SMILESCc1cccc(C)c1\C=C\n1cnc2c(Nc3ccc(cc3)P(C)(C)=O)nc(nc12)N1CCOCC1