Reaction Details
TargetMacrophage colony-stimulating factor 1 receptor
LigandBDBM50244843
Substrate/Competitorn/a
Meas. Tech.ChEMBL_512118 (CHEMBL980054)
IC50 4±n/a nM
Citation Scott, DAAquila, BMBebernitz, GACook, DJDakin, LADeegan, TLHattersley, MMIoannidis, SLyne, PDOmer, CAYe, MZheng, X Pyridyl and thiazolyl bisamide CSF-1R inhibitors for the treatment of cancer. Bioorg Med Chem Lett18:4794-7 (2008) 
 
Macrophage colony-stimulating factor 1 receptor
Name:Macrophage colony-stimulating factor 1 receptor
Type:Protein
Mol. Mass.:107979.48
Organism:Homo sapiens (Human)
Description:P07333
Residue:972
BDBM50244843
NameBDBM50244843
Synonyms:2-Chloro-5-(3-chloro-benzoylamino)-N-(2-methyl-thiazol-5-yl)-benzamide | CHEMBL462133
TypeSmall organic molecule
Emp. Form.C18H13Cl2N3O2S
Mol. Mass.406.286
SMILESCc1ncc(NC(=O)c2cc(NC(=O)c3cccc(Cl)c3)ccc2Cl)s1