Reaction Details
TargetMacrophage colony-stimulating factor 1 receptor
LigandBDBM50244724
Substrate/Competitorn/a
Meas. Tech.ChEMBL_512118 (CHEMBL980054)
IC50 5±n/a nM
Citation Scott, DAAquila, BMBebernitz, GACook, DJDakin, LADeegan, TLHattersley, MMIoannidis, SLyne, PDOmer, CAYe, MZheng, X Pyridyl and thiazolyl bisamide CSF-1R inhibitors for the treatment of cancer. Bioorg Med Chem Lett18:4794-7 (2008) 
 
Macrophage colony-stimulating factor 1 receptor
Name:Macrophage colony-stimulating factor 1 receptor
Type:Protein
Mol. Mass.:107979.48
Organism:Homo sapiens (Human)
Description:P07333
Residue:972
BDBM50244724
NameBDBM50244724
Synonyms:2-chloro-5-[(3,4-dimethylbenzoyl)amino]-N-pyridin-3-ylbenzamide | CHEMBL459471
TypeSmall organic molecule
Emp. Form.C21H18ClN3O2
Mol. Mass.379.84
SMILESCc1ccc(cc1C)C(=O)Nc1ccc(Cl)c(c1)C(=O)Nc1cccnc1