Reaction Details
TargetCathepsin B
LigandBDBM50069792
Substrate/Competitorn/a
Meas. Tech.ChEMBL_512149 (CHEMBL980943)
Ki 150±n/a nM
Citation Donkor, IOKorukonda, R Synthesis and calpain inhibitory activity of peptidomimetic compounds with constrained amino acids at the P2 position. Bioorg Med Chem Lett18:4806-8 (2008) 
 
Cathepsin B
Name:Cathepsin B
Type:Enzyme
Mol. Mass.:37819.69
Organism:Homo sapiens (Human)
Description:gi_63102437
Residue:339
BDBM50069792
NameBDBM50069792
Synonyms:(2S)-2-[(2S)-2-acetamido-4-methylpentanamido]-N-[(1S)-1-formylpentyl]-4-methylpentanamide CHEMBL304784 N-acetylleucylleucylnorleucinal
TypeSmall organic molecule
Emp. Form.C20H37N3O4
Mol. Mass.383.5255
SMILESCCCC[C@H](NC(=O)[C@H](CC(C)C)NC(=O)[C@H](CC(C)C)NC(C)=O)C=O