Reaction Details
TargetCalpain-1 catalytic subunit
LigandBDBM50244952
Substrate/Competitorn/a
Meas. Tech.ChEMBL_512148 (CHEMBL980942)
Ki 80±n/a nM
Citation Donkor, IOKorukonda, R Synthesis and calpain inhibitory activity of peptidomimetic compounds with constrained amino acids at the P2 position. Bioorg Med Chem Lett18:4806-8 (2008) 
 
Calpain-1 catalytic subunit
Name:Calpain-1 catalytic subunit
Type:Catalytic subunit; forms a heterodimer with a small (regulatory) subunit (CAPNS1)
Mol. Mass.:81729.82
Organism:Sus scrofa (pig)
Description:Native calpain-1 from porcine erythrocytes, purchased from Calbiochem, was used in assay.
Residue:714
BDBM50244952
NameBDBM50244952
Synonyms:(S)-2-ethyl-N-(1-oxo-3-phenylpropan-2-yl)-2-(3-phenylpropanamido)butanamide | CHEMBL513049
TypeSmall organic molecule
Emp. Form.C24H30N2O3
Mol. Mass.394.5066
SMILESCCC(CC)(NC(=O)CCc1ccccc1)C(=O)N[C@@H](Cc1ccccc1)C=O