Reaction Details
TargetProtein kinase C alpha type
LigandBDBM50244740
Substrate/Competitorn/a
Meas. Tech.ChEMBL_512395 (CHEMBL979906)
Ki 3.38±n/a nM
Citation Duan, DSigano, DMKelley, JALai, CCLewin, NEKedei, NPeach, MLLee, JAbeyweera, TPRotenberg, SAKim, HKim, YHEl Kazzouli, SChung, JUYoung, HAYoung, MRBaker, AColburn, NHHaimovitz-Friedman, ATruman, JPParrish, DADeschamps, JRPerry, NASurawski, RJBlumberg, PMMarquez, VE Conformationally constrained analogues of diacylglycerol. 29. Cells sort diacylglycerol-lactone chemical zip codes to produce diverse and selective biological activities. J Med Chem51:5198-220 (2008) 
 
Protein kinase C alpha type
Name:Protein kinase C alpha type
Type:Enzyme Catalytic Domain
Mol. Mass.:76858.67
Organism:MOUSE
Description:Protein kinase C 0 MOUSE::P20444
Residue:672
BDBM50244740
NameBDBM50244740
Synonyms:CHEMBL461372 rac-(E/Z)-(4-(4-chloro-3-fluorobenzylidene)-2-(hydroxymethyl)-5-oxo-tetrahydrofuran-2-yl)methyl 2-propylpentanoate
TypeSmall organic molecule
Emp. Form.C21H26ClFO5
Mol. Mass.412.88
SMILESCCCC(CCC)C(=O)OCC1(CO)C\C(=C/c2ccc(Cl)c(F)c2)C(=O)O1