Reaction Details
TargetPeroxisome proliferator-activated receptor gamma
LigandBDBM50244654
Substrate/Competitorn/a
Meas. Tech.ChEMBL_512441 (CHEMBL980782)
IC50 54±n/a nM
Citation Debenham, SDChan, ALau, FWLiu, WWood, HBLemme, KColwell, LHabulihaz, BAkiyama, TEEinstein, MDoebber, TWSharma, NWang, CFWu, MBerger, JPMeinke, PT Highly functionalized 7-azaindoles as selective PPAR gamma modulators. Bioorg Med Chem Lett18:4798-801 (2008) 
 
Peroxisome proliferator-activated receptor gamma
Name:Peroxisome proliferator-activated receptor gamma
Type:Nuclear Receptor
Mol. Mass.:57613.46
Organism:Homo sapiens (Human)
Description:P37231
Residue:505
BDBM50244654
NameBDBM50244654
Synonyms:(S)-2-(3-((3-(4-chlorophenoxy)-2-methyl-1H-pyrrolo[2,3-b]pyridin-1-yl)methyl)-4-fluorophenoxy)propanoic acid | CHEMBL509369
TypeSmall organic molecule
Emp. Form.C24H20ClFN2O4
Mol. Mass.454.878
SMILESC[C@H](Oc1ccc(F)c(Cn2c(C)c(Oc3ccc(Cl)cc3)c3cccnc23)c1)C(O)=O