Reaction Details
TargetPeroxisome proliferator-activated receptor delta
LigandBDBM50244654
Substrate/Competitorn/a
Meas. Tech.ChEMBL_512450 (CHEMBL980791)
IC50>50000±n/a nM
Citation Debenham, SDChan, ALau, FWLiu, WWood, HBLemme, KColwell, LHabulihaz, BAkiyama, TEEinstein, MDoebber, TWSharma, NWang, CFWu, MBerger, JPMeinke, PT Highly functionalized 7-azaindoles as selective PPAR gamma modulators. Bioorg Med Chem Lett18:4798-801 (2008) 
 
Peroxisome proliferator-activated receptor delta
Name:Peroxisome proliferator-activated receptor delta
Type:Enzyme
Mol. Mass.:49910.45
Organism:Homo sapiens (Human)
Description:Q03181
Residue:441
BDBM50244654
NameBDBM50244654
Synonyms:(S)-2-(3-((3-(4-chlorophenoxy)-2-methyl-1H-pyrrolo[2,3-b]pyridin-1-yl)methyl)-4-fluorophenoxy)propanoic acid | CHEMBL509369
TypeSmall organic molecule
Emp. Form.C24H20ClFN2O4
Mol. Mass.454.878
SMILESC[C@H](Oc1ccc(F)c(Cn2c(C)c(Oc3ccc(Cl)cc3)c3cccnc23)c1)C(O)=O