Reaction Details
TargetNeutrophil elastase
LigandBDBM50244756
Substrate/Competitorn/a
Meas. Tech.ChEMBL_512649 (CHEMBL969699)
Ki 28±n/a nM
Citation Eilfeld, AGonzález Tanarro, CMFrizler, MSieler, JSchulze, BGütschow, M Synthesis and elastase-inhibiting activity of 2-pyridinyl-isothiazol-3(2H)-one 1,1-dioxides. Bioorg Med Chem16:8127-35 (2008) 
 
Neutrophil elastase
Name:Neutrophil elastase
Type:Enzyme
Mol. Mass.:28532.38
Organism:Homo sapiens (Human)
Description:P08246
Residue:267
BDBM50244756
NameBDBM50244756
Synonyms:2-(2,3,5,6-Tetrafluoropyridin-4-yl)-1,2-benzisothiazol-3(2H)-one 1,1-dioxide | CHEMBL518500
TypeSmall organic molecule
Emp. Form.C12H4F4N2O3S
Mol. Mass.332.23
SMILESFc1nc(F)c(F)c(N2C(=O)c3ccccc3S2(=O)=O)c1F