Reaction Details
TargetB1 bradykinin receptor
LigandBDBM50244472
Substrate/Competitorn/a
Meas. Tech.ChEMBL_512956 (CHEMBL977292)
Ki 6.4±n/a nM
Citation Biswas, KAya, TQian, WPeterkin, TAChen, JJHuman, JHungate, RWKumar, GArik, LLester-Zeiner, DBiddlecome, GManning, BHSun, HDong, HHuang, MLoeloff, RJohnson, EJAskew, BC Aryl sulfones as novel bradykinin B1 receptor antagonists for treatment of chronic pain. Bioorg Med Chem Lett18:4764-9 (2008) 
 
B1 bradykinin receptor
Name:B1 bradykinin receptor
Type:Enzyme
Mol. Mass.:40508.87
Organism:Homo sapiens (Human)
Description:P46663
Residue:353
BDBM50244472
NameBDBM50244472
Synonyms:(S)-3-methoxy-4-(naphthalen-2-ylsulfonyl)-N-((R)-6-(piperidin-1-ylmethyl)-1,2,3,4-tetrahydronaphthalen-1-yl)butanamide | CHEMBL487823
TypeSmall organic molecule
Emp. Form.C31H38N2O4S
Mol. Mass.534.709
SMILESCO[C@@H](CC(=O)N[C@@H]1CCCc2cc(CN3CCCCC3)ccc12)CS(=O)(=O)c1ccc2ccccc2c1