Reaction Details
TargetRhodopsin
LigandBDBM50158383
Substrate/Competitorn/a
Meas. Tech.ChEMBL_513184 (CHEMBL977314)
IC50 15000±n/a nM
Citation Taylor, CMBarda, YKisselev, OGMarshall, GR Modulating G-protein coupled receptor/G-protein signal transduction by small molecules suggested by virtual screening. J Med Chem51:5297-303 (2008) 
 
Rhodopsin
Name:Rhodopsin
Type:PROTEIN
Mol. Mass.:39006.28
Organism:Bos taurus
Description:ChEMBL_513184
Residue:348
BDBM50158383
NameBDBM50158383
Synonyms:2-((8S,9S,10R,13S,14S,17S)-10,13-dimethyl-3-oxo-2,3,6,7,8,9,10,11,12,13,14,15,16,17-tetradecahydro-1H-cyclopenta[a]phenanthren-17-yl)-2-oxoethyl 4-bromobenzenesulfonate 4-Pregnen-21-ol-3,20-dione-21-(4-bromobenzenesufonate) NSC-88915
TypeSmall organic molecule
Emp. Form.C27H33BrO5S
Mol. Mass.549.517
SMILESC[C@]12CC[C@H]3[C@@H](CCC4=CC(=O)CC[C@]34C)[C@@H]1CC[C@@H]2C(=O)COS(=O)(=O)c1ccc(Br)cc1