Reaction Details
TargetRas guanyl-releasing protein 3
LigandBDBM50245019
Substrate/Competitorn/a
Meas. Tech.ChEMBL_513189 (CHEMBL977319)
Ki 44±n/a nM
Citation El Kazzouli, SLewin, NEBlumberg, PMMarquez, VE Conformationally constrained analogues of diacylglycerol. 30. An investigation of diacylglycerol-lactones containing heteroaryl groups reveals compounds with high selectivity for Ras guanyl nucleotide-releasing proteins. J Med Chem51:5371-86 (2008) 
 
Ras guanyl-releasing protein 3
Name:Ras guanyl-releasing protein 3
Type:PROTEIN
Mol. Mass.:78335.20
Organism:Homo sapiens (Human)
Description:ChEMBL_1364407
Residue:690
BDBM50245019
NameBDBM50245019
Synonyms:(Z)-(2-(hydroxymethyl)-5-oxo-4-(pyridin-4-ylmethylene)-tetrahydrofuran-2-yl)methyl 2-propylpentanoate | CHEMBL443643
TypeSmall organic molecule
Emp. Form.C20H27NO5
Mol. Mass.361.4321
SMILESCCCC(CCC)C(=O)OCC1(CO)C\C(=C\c2ccncc2)C(=O)O1