Reaction Details
TargetGastric inhibitory polypeptide receptor
LigandBDBM50244505
Substrate/Competitorn/a
Meas. Tech.ChEMBL_513212 (CHEMBL977342)
IC50 220±n/a nM
Citation Kodra, JTJørgensen, ASAndersen, BBehrens, CBrand, CLChristensen, ITGuldbrandt, MJeppesen, CBKnudsen, LBMadsen, PNishimura, ESams, CSidelmann, UGPedersen, RALynn, FCLau, J Novel glucagon receptor antagonists with improved selectivity over the glucose-dependent insulinotropic polypeptide receptor. J Med Chem51:5387-96 (2008) 
 
Gastric inhibitory polypeptide receptor
Name:Gastric inhibitory polypeptide receptor
Type:PROTEIN
Mol. Mass.:53173.82
Organism:Homo sapiens (Human)
Description:ChEMBL_1518286
Residue:466
BDBM50244505
NameBDBM50244505
Synonyms:(R)-trans-3-{4-[1-(4-tert-Butylcyclohexyl)-3-(3,5-dimethylphenyl)ureidomethyl]benzoylamino}-2-hydroxypropionic acid | CHEMBL452067
TypeSmall organic molecule
Emp. Form.C30H41N3O5
Mol. Mass.523.6636
SMILESCc1cc(C)cc(NC(=O)N(Cc2ccc(cc2)C(=O)NC[C@@H](O)C(O)=O)[C@H]2CC[C@@H](CC2)C(C)(C)C)c1