Reaction Details
TargetGastric inhibitory polypeptide receptor
LigandBDBM50244457
Substrate/Competitorn/a
Meas. Tech.ChEMBL_513212 (CHEMBL977342)
IC50 87±n/a nM
Citation Kodra, JTJørgensen, ASAndersen, BBehrens, CBrand, CLChristensen, ITGuldbrandt, MJeppesen, CBKnudsen, LBMadsen, PNishimura, ESams, CSidelmann, UGPedersen, RALynn, FCLau, J Novel glucagon receptor antagonists with improved selectivity over the glucose-dependent insulinotropic polypeptide receptor. J Med Chem51:5387-96 (2008) 
 
Gastric inhibitory polypeptide receptor
Name:Gastric inhibitory polypeptide receptor
Type:PROTEIN
Mol. Mass.:53173.82
Organism:Homo sapiens (Human)
Description:ChEMBL_1518286
Residue:466
BDBM50244457
NameBDBM50244457
Synonyms:(R)-trans-3-{4-[3-(3,5-Bis(trifluoromethyl)phenyl)-1-(4-tert-butylcyclohexyl)ureidomethyl]-benzoylamino}-2-hydroxypropionic acid | CHEMBL499160
TypeSmall organic molecule
Emp. Form.C30H35F6N3O5
Mol. Mass.631.6064
SMILESCC(C)(C)[C@H]1CC[C@@H](CC1)N(Cc1ccc(cc1)C(=O)NC[C@@H](O)C(O)=O)C(=O)Nc1cc(cc(c1)C(F)(F)F)C(F)(F)F