Reaction Details
TargetTyrosine-protein phosphatase non-receptor type 2
LigandBDBM50246743
Substrate/Competitorn/a
Meas. Tech.ChEMBL_557716 (CHEMBL963011)
IC50 490±n/a nM
Citation Zhang, YNZhang, WHong, DShi, LShen, QLi, JYLi, JHu, LH Oleanolic acid and its derivatives: new inhibitor of protein tyrosine phosphatase 1B with cellular activities. Bioorg Med Chem16:8697-705 (2008) 
 
Tyrosine-protein phosphatase non-receptor type 2
Name:Tyrosine-protein phosphatase non-receptor type 2
Type:Protein
Mol. Mass.:48481.80
Organism:Homo sapiens (Human)
Description:P17706
Residue:415
BDBM50246743
NameBDBM50246743
Synonyms:(4aS,6aS,6bR,8aR,10S,12aR,12bR,14bS)-10-(3-carboxybenzyloxy)-2,2,6a,6b,9,9,12a-heptamethyl-1,2,3,4,4a,5,6,6a,6b,7,8,8a,9,10,11,12,12a,12b,13,14b-icosahydropicene-4a-carboxylic acid | CHEMBL506556
TypeSmall organic molecule
Emp. Form.C38H54O5
Mol. Mass.590.8324
SMILESCC1(C)CC[C@@]2(CC[C@]3(C)C(=CC[C@@H]4[C@@]5(C)CC[C@H](OCc6cccc(c6)C(O)=O)C(C)(C)[C@@H]5CC[C@@]34C)[C@@H]2C1)C(O)=O