Reaction Details
TargetTyrosine-protein phosphatase non-receptor type 1
LigandBDBM50246744
Substrate/Competitorn/a
Meas. Tech.ChEMBL_557715 (CHEMBL963010)
IC50 540±n/a nM
Citation Zhang, YNZhang, WHong, DShi, LShen, QLi, JYLi, JHu, LH Oleanolic acid and its derivatives: new inhibitor of protein tyrosine phosphatase 1B with cellular activities. Bioorg Med Chem16:8697-705 (2008) 
 
Tyrosine-protein phosphatase non-receptor type 1
Name:Tyrosine-protein phosphatase non-receptor type 1
Type:Protein phosphatase
Mol. Mass.:49963.76
Organism:Homo sapiens (Human)
Description:Human recombinant GST-fusion PTP1B (1-435).
Residue:435
BDBM50246744
NameBDBM50246744
Synonyms:(4aS,6aS,6bR,8aR,10S,12aR,12bR,14bS)-10-(4-carboxybenzyloxy)-2,2,6a,6b,9,9,12a-heptamethyl-1,2,3,4,4a,5,6,6a,6b,7,8,8a,9,10,11,12,12a,12b,13,14b-icosahydropicene-4a-carboxylic acid | CHEMBL508831
TypeSmall organic molecule
Emp. Form.C38H54O5
Mol. Mass.590.8324
SMILESCC1(C)CC[C@@]2(CC[C@]3(C)C(=CC[C@@H]4[C@@]5(C)CC[C@H](OCc6ccc(cc6)C(O)=O)C(C)(C)[C@@H]5CC[C@@]34C)[C@@H]2C1)C(O)=O